BDBM50364728 CHEMBL1951667
SMILES COc1ccc(c(F)c1)-n1ccc2c(sc3nccc(N(C)C)c23)c1=O
InChI Key InChIKey=UMDKBGDQXHBTGM-UHFFFAOYSA-N
Data  1 KI  2 IC50
  Tab Delimited (TSV)   2D SDfile   Computed 3D by Vconf -m prep SDfile
Find this compound or compounds like it in BindingDB:
Activity Spreadsheet -- Enzyme Inhibition Constant Data from BindingDB
Found 3 hits for monomerid = 50364728
TargetMetabotropic glutamate receptor 1(RAT)
Merck Research Laboratories
Curated by ChEMBL
LigandPNGBDBM50364728(CHEMBL1951667)
Affinity DataKi:  19nM. Assay description: Antagonist activity at rat metabotropic glutamate receptor 1
In DepthDetails ArticlePubMed
TargetMetabotropic glutamate receptor 1(Homo sapiens (Human))
Merck Research Laboratories
Curated by ChEMBL
LigandPNGBDBM50364728(CHEMBL1951667)
Affinity DataIC50:  14nM. Assay description: Antagonist activity at human metabotropic glutamate receptor 1
In DepthDetails ArticlePubMed
TargetMetabotropic glutamate receptor 5(Homo sapiens (Human))
Merck Research Laboratories
Curated by ChEMBL
LigandPNGBDBM50364728(CHEMBL1951667)
Affinity DataIC50: >1.00E+3nM. Assay description: Antagonist activity at human metabotropic glutamate receptor 5
In DepthDetails ArticlePubMed