BDBM50366572 CHEMBL607911
SMILES OC[C@@H]1OC([C@@H](O)[C@H]1O)n1cnc2C3=N[C@H](CN3C=Nc12)c1ccccc1
InChI Key InChIKey=YFXFAXXXFDPKSO-HSNRXGLCSA-N
Data  3 KI
  Tab Delimited (TSV)   2D SDfile   Computed 3D by Vconf -m prep SDfile
Find this compound or compounds like it in BindingDB:
Activity Spreadsheet -- Enzyme Inhibition Constant Data from BindingDB
Found 3 hits for monomerid = 50366572
TargetAdenosine receptor A1(Rattus norvegicus (rat))
Griffith University
Curated by ChEMBL
LigandPNGBDBM50366572(CHEMBL607911)
Affinity DataKi:  4.54E+3nM. Assay description: Binding affinity against adenosine A1 receptor in rat brain using [3H]R-PIA
In DepthDetails ArticlePubMed
TargetAdenosine receptor A1(Rattus norvegicus (rat))
Griffith University
Curated by ChEMBL
LigandPNGBDBM50366572(CHEMBL607911)
Affinity DataKi:  4.54E+3nM. Assay description: Binding affinity for rat brain Adenosine A1 receptor
In DepthDetails ArticlePubMed
TargetAdenosine receptor A2a(Rattus norvegicus (rat))
Griffith University
Curated by ChEMBL
LigandPNGBDBM50366572(CHEMBL607911)
Affinity DataKi:  1.89E+5nM. Assay description: Binding affinity against Adenosine A2a receptor from rat striata
In DepthDetails ArticlePubMed