BDBM50366608 CHEMBL1202834
SMILES O=c1ccc2C(CCCc2[nH]1)NCCCCCCNc1c2CCCCc2nc2ccccc12
InChI Key InChIKey=ONEALBXSYQQMFZ-UHFFFAOYSA-N
Data  2 IC50
  Tab Delimited (TSV)   2D SDfile   Computed 3D by Vconf -m prep SDfile
Find this compound or compounds like it in BindingDB:
Activity Spreadsheet -- Enzyme Inhibition Constant Data from BindingDB
Found 2 hits for monomerid = 50366608
TargetAcetylcholinesterase(Rattus norvegicus (rat))
Hong Kong University Of Science And Technology
Curated by ChEMBL
LigandPNGBDBM50366608(CHEMBL1202834)
Affinity DataIC50:  37nM. Assay description: Inhibitory potency against acetylcholinesterase (AChE) of rat cortex homogenate with ethopropazine as BChE inhibitor
In DepthDetails ArticlePubMed
TargetCarboxylic ester hydrolase(Rattus norvegicus (rat))
Hong Kong University Of Science And Technology
Curated by ChEMBL
LigandPNGBDBM50366608(CHEMBL1202834)
Affinity DataIC50:  223nM. Assay description: Inhibitory potency against rat serum Butyrylcholinesterase with BW284c51 as AChE inhibitor
In DepthDetails ArticlePubMed