BDBM50367073 CHEMBL3350528::CHEMBL609819
SMILES CN(CCCCCCN(C)c1ncnc2n(cnc12)[C@@H]1O[C@H](COP(O)(=O)OP(O)(=O)OP(O)(O)=O)[C@@H](O)[C@H]1O)C(=O)CCCCCNC(=O)CI
InChI Key InChIKey=USGQSXRZQMBGKQ-LDEFLUHMSA-N
Data  2 KI
  Tab Delimited (TSV)   2D SDfile   Computed 3D by Vconf -m prep SDfile
Find this compound or compounds like it in BindingDB:
Activity Spreadsheet -- Enzyme Inhibition Constant Data from BindingDB
Found 2 hits for monomerid = 50367073
TargetAdenylate kinase 2, mitochondrial(Rattus norvegicus)
TBA
Curated by ChEMBL
LigandPNGBDBM50367073(CHEMBL3350528 | CHEMBL609819)
Affinity DataKi:  1.90E+6nM. Assay description: Ability to inhibit rat adenylate kinase II, activity expressed as Inhibition constant
In DepthDetails ArticlePubMed
TargetGTP:AMP phosphotransferase AK3, mitochondrial(Rattus norvegicus)
TBA
Curated by ChEMBL
LigandPNGBDBM50367073(CHEMBL3350528 | CHEMBL609819)
Affinity DataKi:  2.40E+6nM. Assay description: Ability to inhibit rat adenylate kinase III, activity expressed as Inhibition constant; Competitive inhibition
In DepthDetails ArticlePubMed