BDBM50367094 DEOXYCYTIDINE::EN300-6477283
SMILES Nc1ccn([C@H]2C[C@H](O)[C@@H](CO)O2)c(=O)n1
InChI Key InChIKey=CKTSBUTUHBMZGZ-SHYZEUOFSA-N
Data  1 KI  1 IC50  2 Kd
PDB links: 28 PDB IDs match this monomer.
  Tab Delimited (TSV)   2D SDfile   Computed 3D by Vconf -m prep SDfile
Find this compound or compounds like it in BindingDB:
Activity Spreadsheet -- Enzyme Inhibition Constant Data from BindingDB
Found 4 hits for monomerid = 50367094
TargetThymidine kinase 2, mitochondrial (Predicted)(Rattus norvegicus)
TBA
Curated by ChEMBL
LigandPNGBDBM50367094(DEOXYCYTIDINE | EN300-6477283)
Affinity DataKi:  3.20E+5nM. Assay description: Competitive inhibition against rat mitochondrial thymidine kinase
In DepthDetails ArticlePubMed
TargetReverse transcriptase protein(Human immunodeficiency virus 1)
Veterans Affairs Medical Center
Curated by ChEMBL
LigandPNGBDBM50367094(DEOXYCYTIDINE | EN300-6477283)
Affinity DataKd:  3.00E+3nM. Assay description: Binding affinity to HIV1 reverse transcriptase M184V mutant assessed as L-3'-azido-NTP incorporation in nascent DNA
In DepthDetails ArticlePubMed
TargetReplicase polyprotein 1ab(2019-nCoV)
Cornell University
LigandPNGBDBM50367094(DEOXYCYTIDINE | EN300-6477283)
Affinity DataIC50:  1.84E+3nM. Assay description: IC50 values were determined for the whole plate in case of Chan-Lam coupling, using 5 point 3-fold dilutions (starting from 10 μM).
In DepthDetails PubMed
TargetReverse transcriptase(Human immunodeficiency virus 1)
Veterans Affairs Medical Center
Curated by ChEMBL
LigandPNGBDBM50367094(DEOXYCYTIDINE | EN300-6477283)
Affinity DataKd:  1.10E+3nM. Assay description: Binding affinity to HIV1 reverse transcriptase assessed as L-3'-azido-NTP incorporation in nascent DNA
In DepthDetails ArticlePubMed