BDBM50367311 CHEMBL607763
SMILES C[C@H](Cc1ccccc1)Nc1ncnc2n(cnc12)C1O[C@H](C)[C@@H](O)[C@H]1O
InChI Key InChIKey=BOZPDAHEDOGGOU-SHQIVCLASA-N
Data  5 KI
  Tab Delimited (TSV)   2D SDfile   Computed 3D by Vconf -m prep SDfile
Find this compound or compounds like it in BindingDB:
Activity Spreadsheet -- Enzyme Inhibition Constant Data from BindingDB
Found 5 hits for monomerid = 50367311
TargetAdenosine receptor A1(Rattus norvegicus (rat))
TBA
Curated by ChEMBL
LigandPNGBDBM50367311(CHEMBL607763)
Affinity DataKi:  25nM. Assay description: Binding affinity for adenosine A1 receptor in rat brain membranes using [3H]CHA as radioligand
In DepthDetails ArticlePubMed
TargetAdenosine receptor A1(Rattus norvegicus (rat))
TBA
Curated by ChEMBL
LigandPNGBDBM50367311(CHEMBL607763)
Affinity DataKi:  300nM. Assay description: Affinity for the Adenosine A1 receptor in the absence of GTP (A1-GTP) by using [3H]DPCPX as radioligand
In DepthDetails ArticlePubMed
TargetAdenosine receptor A1(Rattus norvegicus (rat))
TBA
Curated by ChEMBL
LigandPNGBDBM50367311(CHEMBL607763)
Affinity DataKi:  1.07E+3nM. Assay description: Affinity for the Adenosine A1 receptor in the presence of GTP (A1+GTP) by using [3H]-DPCPX as radioligand
In DepthDetails ArticlePubMed
TargetAdenosine receptor A2a/A2b(Rattus norvegicus)
TBA
Curated by ChEMBL
LigandPNGBDBM50367311(CHEMBL607763)
Affinity DataKi:  3.30E+3nM. Assay description: Binding affinity for adenosine A2 receptor in rat striatal membranes using [3H]NECA as radioligand
In DepthDetails ArticlePubMed
TargetAdenosine receptor A2a(Rattus norvegicus (rat))
Leiden University
Curated by ChEMBL
LigandPNGBDBM50367311(CHEMBL607763)
Affinity DataKi:  3.67E+3nM. Assay description: Binding affinity against Adenosine A2A receptor by using [3H]CGS-21680 as radioligand
In DepthDetails ArticlePubMed