BDBM50367548 CHEMBL1794921
SMILES Clc1ccc(cc1)C(C1=CN=CNC1)c1ccc(Cl)cc1
InChI Key InChIKey=UGPDPWDKYPGRMP-UHFFFAOYSA-N
Data  1 EC50
  Tab Delimited (TSV)   2D SDfile   Computed 3D by Vconf -m prep SDfile
Find this compound or compounds like it in BindingDB:
Activity Spreadsheet -- Enzyme Inhibition Constant Data from BindingDB
Found 1 hit for monomerid = 50367548
TargetAromatase(Rattus norvegicus)
TBA
Curated by ChEMBL
LigandPNGBDBM50367548(CHEMBL1794921)
Affinity DataEC50:  50nM. Assay description: In vitro inhibition of cytochrome P450 19A1 by rat ovarian microsomes incubated with [3H]androstenedione and NADPH-generating system.
In DepthDetails ArticlePubMed