BDBM50367725 CHEMBL1202520
SMILES O=C1N(CCCCN2CCN(CC2)c2ncccn2)C(=O)C23C4CC(C=C4)C12C1CC3C=C1
InChI Key InChIKey=AGAOOOLNXNYSOT-UHFFFAOYSA-N
Data  1 KI
  Tab Delimited (TSV)   2D SDfile   Computed 3D by Vconf -m prep SDfile
Find this compound or compounds like it in BindingDB:
Activity Spreadsheet -- Enzyme Inhibition Constant Data from BindingDB
Found 1 hit for monomerid = 50367725
Target5-hydroxytryptamine receptor 1A(Rattus norvegicus (rat))
Wyeth-Ayerst Research
Curated by ChEMBL
LigandPNGBDBM50367725(CHEMBL1202520)
Affinity DataKi:  14nM. Assay description: In vitro inhibition of [3H]spiperone binding to 5-hydroxytryptamine 1A receptor from rat hippocampal tissue.
In DepthDetails ArticlePubMed