BDBM50367851 CHEMBL1788291
SMILES CCN[C@H]1CCS(=O)(=O)c2sc(cc12)S(N)(=O)=O
InChI Key InChIKey=QUEWYBQAGQXUCP-ZETCQYMHSA-N
Data  1 KI
  Tab Delimited (TSV)   2D SDfile   Computed 3D by Vconf -m prep SDfile
Find this compound or compounds like it in BindingDB:
Activity Spreadsheet -- Enzyme Inhibition Constant Data from BindingDB
Found 1 hit for monomerid = 50367851
TargetCarbonic anhydrase 2(Homo sapiens (Human))
Merck Sharp And Dohme
Curated by ChEMBL
LigandPNGBDBM50367851(CHEMBL1788291)
Affinity DataKi:  0.820nM. Assay description: 50% inhibitory concentration against human carbonic anhydrase II (HCA II) after pre-incubation at 3 degree C
In DepthDetails ArticlePubMed