BDBM50367945 CHEMBL1203008
SMILES CN1CCC=C(C1)c1csc(N)n1
InChI Key InChIKey=NIYQDDWHZSGDEQ-UHFFFAOYSA-N
Data  1 IC50
  Tab Delimited (TSV)   2D SDfile   Computed 3D by Vconf -m prep SDfile
Find this compound or compounds like it in BindingDB:
Activity Spreadsheet -- Enzyme Inhibition Constant Data from BindingDB
Found 1 hit for monomerid = 50367945
TargetD(2) dopamine receptor(Rattus norvegicus (rat))
Warner-Lambert
Curated by ChEMBL
LigandPNGBDBM50367945(CHEMBL1203008)
Affinity DataIC50:  1.04E+3nM. Assay description: Inhibition of [3H]haloperidol binding for Dopamine receptor D2 in rat striatal membranes.
In DepthDetails ArticlePubMed