BDBM50368081 CHEMBL3217116::CHEMBL522538
SMILES Cl.Cl.NC(=N)c1cccc(OCCCOc2cccc(c2)C(N)=N)c1
InChI Key InChIKey=MEZWPABKRYXWOE-UHFFFAOYSA-N
Data  1 KI
  Tab Delimited (TSV)   2D SDfile   Computed 3D by Vconf -m prep SDfile
Find this compound or compounds like it in BindingDB:
Activity Spreadsheet -- Enzyme Inhibition Constant Data from BindingDB
Found 1 hit for monomerid = 50368081
TargetSerine protease 1(Homo sapiens (Human))
University Of North Carolina
Curated by ChEMBL
LigandPNGBDBM50368081(CHEMBL3217116 | CHEMBL522538)
Affinity DataKi:  1.10E+3nM. Assay description: Inhibition of trypsin by amidase assay.
In DepthDetails ArticlePubMed