BDBM50368096 CHEMBL1204157
SMILES NC(=N)c1ccc(NCCCNc2ccc(cc2)C(N)=N)cc1
InChI Key InChIKey=ULZAPTUUAYXQCK-UHFFFAOYSA-N
Data  1 KI
  Tab Delimited (TSV)   2D SDfile   Computed 3D by Vconf -m prep SDfile
Find this compound or compounds like it in BindingDB:
Activity Spreadsheet -- Enzyme Inhibition Constant Data from BindingDB
Found 1 hit for monomerid = 50368096
TargetSerine protease 1(Homo sapiens (Human))
University Of North Carolina
Curated by ChEMBL
LigandPNGBDBM50368096(CHEMBL1204157)
Affinity DataKi:  1.10E+3nM. Assay description: Inhibition of trypsin by amidase assay.
In DepthDetails ArticlePubMed