BDBM50368168 CHEMBL609353
SMILES Nc1ncnc2n(cnc12)C1O[C@H](C(F)F)[C@@H](O)[C@H]1O
InChI Key InChIKey=YQLJSFYLQCBEKY-TXDDJGQJSA-N
Data  3 KI
  Tab Delimited (TSV)   2D SDfile   Computed 3D by Vconf -m prep SDfile
Find this compound or compounds like it in BindingDB:
Activity Spreadsheet -- Enzyme Inhibition Constant Data from BindingDB
Found 3 hits for monomerid = 50368168
TargetAdenosylhomocysteinase(Rattus norvegicus)
Merrell Dow Research Institute
Curated by ChEMBL
LigandPNGBDBM50368168(CHEMBL609353)
Affinity DataKi:  9.70E+3nM. Assay description: Competitive inhibitory activity against rat liver S-adenosyl-L-homocysteine hydrolase
In DepthDetails ArticlePubMed
TargetAdenosylhomocysteinase(Rattus norvegicus)
Merrell Dow Research Institute
Curated by ChEMBL
LigandPNGBDBM50368168(CHEMBL609353)
Affinity DataKi:  9.70E+3nM. Assay description: Activity determined in rat liver S-adenosyl-L-homocysteine hydrolase and expressed as Kinactivator values.
In DepthDetails ArticlePubMed
TargetAdenosylhomocysteinase(Mus musculus)
Merrell Dow Research Institute
Curated by ChEMBL
LigandPNGBDBM50368168(CHEMBL609353)
Affinity DataKi:  1.00E+4nM. Assay description: Activity determined in mouse liver S-adenosyl-L-homocysteine hydrolase and expressed as KI values.
In DepthDetails ArticlePubMed