BDBM50368197 CHEMBL2235597::CHEMBL603935
SMILES OC[C@H]1O[C@H]([C@H](O)[C@@H]1O)n1cnc2c(NC3CSc4ccccc4C3)ncnc12
InChI Key InChIKey=OJEJDINFDFFWFP-ZHYOAVQCSA-N
Data  2 KI
  Tab Delimited (TSV)   2D SDfile   Computed 3D by Vconf -m prep SDfile
Find this compound or compounds like it in BindingDB:
Activity Spreadsheet -- Enzyme Inhibition Constant Data from BindingDB
Found 2 hits for monomerid = 50368197
TargetAdenosine receptor A1(Rattus norvegicus (rat))
Warner-Lambert
Curated by ChEMBL
LigandPNGBDBM50368197(CHEMBL2235597 | CHEMBL603935)
Affinity DataKi:  3.60nM. Assay description: Binding affinity towards adenosine A1 receptor
In DepthDetails ArticlePubMed
TargetAdenosine receptor A2a/A2b(Rattus norvegicus)
Warner-Lambert
Curated by ChEMBL
LigandPNGBDBM50368197(CHEMBL2235597 | CHEMBL603935)
Affinity DataKi:  229nM. Assay description: Binding affinity towards adenosine A2 receptor
In DepthDetails ArticlePubMed