BDBM50368463 CHEMBL608175
SMILES Nc1nc(N=NCc2cccc3ccccc23)nc2n(cnc12)C1O[C@H](CO)[C@@H](O)[C@H]1O
InChI Key InChIKey=XWQFVOLUAFGCQP-FIALEDGQSA-N
Data  1 EC50
  Tab Delimited (TSV)   2D SDfile   Computed 3D by Vconf -m prep SDfile
Find this compound or compounds like it in BindingDB:
Activity Spreadsheet -- Enzyme Inhibition Constant Data from BindingDB
Found 1 hit for monomerid = 50368463
TargetAdenosine receptor A1(GUINEA PIG)
University Of South Florida
Curated by ChEMBL
LigandPNGBDBM50368463(CHEMBL608175)
Affinity DataEC50:  832nM. Assay description: Tested for adenosine A1 receptor agonistic activity by determining concentration needed to prolong the stimulus-QRS interval by 50% of the maximum re...Checked by Author
In DepthDetails ArticlePubMed