BDBM50368594 CHEMBL1794998
SMILES CCCN(CCC)C1CN2CCCc3cccc(C1)c23
InChI Key InChIKey=GWMBKHSMFOROGY-UHFFFAOYSA-N
Data  2 KI
  Tab Delimited (TSV)   2D SDfile   Computed 3D by Vconf -m prep SDfile
Find this compound or compounds like it in BindingDB:
Activity Spreadsheet -- Enzyme Inhibition Constant Data from BindingDB
Found 2 hits for monomerid = 50368594
TargetD(2) dopamine receptor(Rattus norvegicus (rat))
Upjohn Laboratories
Curated by ChEMBL
LigandPNGBDBM50368594(CHEMBL1794998)
Affinity DataKi:  35nM. Assay description: Ability to displace [3H]raclopride from dopamine receptor D2 in rat striatal homogenates.
In DepthDetails ArticlePubMed
Target5-hydroxytryptamine receptor 1A(Homo sapiens (Human))
Upjohn Laboratories
Curated by ChEMBL
LigandPNGBDBM50368594(CHEMBL1794998)
Affinity DataKi:  105nM. Assay description: Ability to displace [3H]-DPAT from 5-hydroxytryptamine 1A receptor in homogenates of bovine hippocampus.
In DepthDetails ArticlePubMed