BDBM50368601 CHEMBL1794048::CHEMBL3349509
SMILES CC[C@H](C)[C@H](NC(=O)[C@@H]1CCCN1C(=O)[C@@H](O)[C@H](Cc1ccccc1)NC(=O)[C@@H](CC(N)=O)NC(=O)OCc1ccccc1)C(=O)N[C@@H](C(C)C)C(=O)OC
InChI Key InChIKey=XVFXESPOILVUDH-WMWINSMWSA-N
Data  1 IC50
  Tab Delimited (TSV)   2D SDfile   Computed 3D by Vconf -m prep SDfile
Find this compound or compounds like it in BindingDB:
Activity Spreadsheet -- Enzyme Inhibition Constant Data from BindingDB
Found 1 hit for monomerid = 50368601
TargetGag-Pol polyprotein [489-587](Human immunodeficiency virus type 1)
Syntex Research
Curated by ChEMBL
LigandPNGBDBM50368601(CHEMBL1794048 | CHEMBL3349509)
Affinity DataIC50:  3.10nM. Assay description: Inhibitory activity of the Compound was tested against HIV protease enzyme.
In DepthDetails ArticlePubMed