BDBM50368675 CHEMBL1744113
SMILES Fc1ccc(cc1)C1CC(N2CCN(CCN3CCCNC3=O)CC2)c2ccc(F)cc12
InChI Key InChIKey=PZHUDBDNTWZLRQ-UHFFFAOYSA-N
Data  5 IC50
  Tab Delimited (TSV)   2D SDfile   Computed 3D by Vconf -m prep SDfile
Find this compound or compounds like it in BindingDB:
Activity Spreadsheet -- Enzyme Inhibition Constant Data from BindingDB
Found 5 hits for monomerid = 50368675
TargetD(2) dopamine receptor(Rattus norvegicus (rat))
H. Lundbeck
Curated by ChEMBL
LigandPNGBDBM50368675(CHEMBL1744113)
Affinity DataIC50:  280nM. Assay description: Displacement of [3H]spiperone from dopamine D2 receptors in rat striatal membranes
In DepthDetails ArticlePubMed
TargetD(2) dopamine receptor(Rattus norvegicus (rat))
H. Lundbeck
Curated by ChEMBL
LigandPNGBDBM50368675(CHEMBL1744113)
Affinity DataIC50:  280nM. Assay description: Displacement of [3H]spiperone from dopamine D2 receptors in rat striatal membranes
In DepthDetails ArticlePubMed
TargetSerotonin 2 (5-HT2) receptor(RAT)
H. Lundbeck
Curated by ChEMBL
LigandPNGBDBM50368675(CHEMBL1744113)
Affinity DataIC50:  1.10nM. Assay description: Displacement of [3H]ketanserin from 5-hydroxytryptamine 2 receptor in rat cortical membranes
In DepthDetails ArticlePubMed
TargetSerotonin 2 (5-HT2) receptor(RAT)
H. Lundbeck
Curated by ChEMBL
LigandPNGBDBM50368675(CHEMBL1744113)
Affinity DataIC50:  1.10nM. Assay description: Displacement of [3H]ketanserin from 5-hydroxytryptamine 2 receptor in rat cortical membranes
In DepthDetails ArticlePubMed
TargetAlpha-1A/Alpha-1B/Alpha-1D adrenergic receptor(Rattus norvegicus (rat))
H. Lundbeck
Curated by ChEMBL
LigandPNGBDBM50368675(CHEMBL1744113)
Affinity DataIC50:  41nM. Assay description: Displacement of [3H]prazosin from alpha-1 adrenoceptors in whole rat brain membranes
In DepthDetails ArticlePubMed