BDBM50368708 CHEMBL611890
SMILES Nc1ncnc2n(nc(I)c12)C1O[C@H](CCl)[C@@H](O)[C@H]1O
InChI Key InChIKey=BAEHESBBPXNPGW-RMXRYUSWSA-N
Data  1 KI
  Tab Delimited (TSV)   2D SDfile   Computed 3D by Vconf -m prep SDfile
Find this compound or compounds like it in BindingDB:
Activity Spreadsheet -- Enzyme Inhibition Constant Data from BindingDB
Found 1 hit for monomerid = 50368708
TargetAdenosine kinase(Homo sapiens (Human))
University Of California
Curated by ChEMBL
LigandPNGBDBM50368708(CHEMBL611890)
Affinity DataKi:  300nM. Assay description: Inhibition of human placental adenosine kinase
In DepthDetails ArticlePubMed