BDBM50368762 CHEMBL2369634
SMILES C[C@@H](O)[C@H](NC(C)=O)C(=O)N[C@@H](Cc1ccccc1)C(=O)N[C@@H](CC(N)=O)C(=O)N[C@@H](CCC(O)=O)C(=O)N[C@@H](CC(O)=O)C(=O)N[C@@H](Cc1ccccc1)C(O)=O
InChI Key InChIKey=ORIRKOLDQJKUJO-HYNNOYFOSA-N
Data  2 IC50
  Tab Delimited (TSV)   2D SDfile   Computed 3D by Vconf -m prep SDfile
Find this compound or compounds like it in BindingDB:
Activity Spreadsheet -- Enzyme Inhibition Constant Data from BindingDB
Found 2 hits for monomerid = 50368762
TargetRibonucleoside-diphosphate reductase large subunit(Mus musculus)
University Of Pennsylvania
Curated by ChEMBL
LigandPNGBDBM50368762(CHEMBL2369634)
Affinity DataIC50:  6.00E+5nM. Assay description: Cross inhibitory potency of compound on Saccharomyces cerevisiae R2 C-terminal peptide on mammalian ribonucleotide reductase
In DepthDetails ArticlePubMed
TargetRibonucleoside-diphosphate reductase large subunit(Mus musculus)
University Of Pennsylvania
Curated by ChEMBL
LigandPNGBDBM50368762(CHEMBL2369634)
Affinity DataIC50:  6.00E+5nM. Assay description: Cross inhibitory potency of compound on Saccharomyces cerevisiae R2 C-terminal peptide on mammalian ribonucleotide reductase
In DepthDetails ArticlePubMed