BDBM50368821 CHEMBL1203535
SMILES COC1CCCN(Cc2ccc(CNCCN3CCN=C3C(C#N)C#N)o2)C1
InChI Key InChIKey=FHNUUXXXVIIGGN-UHFFFAOYSA-N
Data  1 IC50
  Tab Delimited (TSV)   2D SDfile   Computed 3D by Vconf -m prep SDfile
Find this compound or compounds like it in BindingDB:
Activity Spreadsheet -- Enzyme Inhibition Constant Data from BindingDB
Found 1 hit for monomerid = 50368821
TargetAcetylcholinesterase(Homo sapiens (Human))
Kyowa Hakko Kogyo
Curated by ChEMBL
LigandPNGBDBM50368821(CHEMBL1203535)
Affinity DataIC50:  3.30E+3nM. Assay description: Inhibition of guinea pig acetylcholinesterase
In DepthDetails ArticlePubMed