BDBM50368885 CHEMBL1627869
SMILES CSP(O)(=O)Oc1ccc2[C@H]3CC[C@@]4(C)[C@@H](CCC4=O)[C@@H]3CCc2c1
InChI Key InChIKey=SBJMSRGJIXBEKA-VXNCWWDNSA-N
Data  1 IC50
  Tab Delimited (TSV)   2D SDfile   Computed 3D by Vconf -m prep SDfile
Find this compound or compounds like it in BindingDB:
Activity Spreadsheet -- Enzyme Inhibition Constant Data from BindingDB
Found 1 hit for monomerid = 50368885
TargetSteryl-sulfatase(Homo sapiens (Human))
University Of Bath
Curated by ChEMBL
LigandPNGBDBM50368885(CHEMBL1627869)
Affinity DataIC50:  4.30E+4nM. Assay description: Tested for inhibition of estrone sulfatase in placental microsomal preparation (100000 g pellet) using substrate concentration of 20 uM
In DepthDetails ArticlePubMed