BDBM50368890 CHEMBL1790792
SMILES CC[C@@H](C)[C@H](NC(=O)[C@H](C(C)C)[C@@H](O)[C@H](O)[C@H](CC1CCCCC1)NC(=O)c1ccccc1SCCCCC[C@@H]1SCC2NC(=O)NC12)C(=O)NCCc1scnc1C
InChI Key InChIKey=IOPVPTNSMVSHSU-OFTDPSHOSA-N
Data  1 KI
  Tab Delimited (TSV)   2D SDfile   Computed 3D by Vconf -m prep SDfile
Find this compound or compounds like it in BindingDB:
Activity Spreadsheet -- Enzyme Inhibition Constant Data from BindingDB
Found 1 hit for monomerid = 50368890
TargetGag-Pol polyprotein [489-587](Human immunodeficiency virus type 1)
Upjohn Laboratories
Curated by ChEMBL
LigandPNGBDBM50368890(CHEMBL1790792)
Affinity DataKi:  4nM. Assay description: In vitro inhibitory activity against biotinylated human HIV-1 protease
In DepthDetails ArticlePubMed