BDBM50369127 CHEMBL395336
SMILES Nc1nc2n(cnc2c(=O)[nH]1)[C@@H]1O[C@@H]2CO[P@](O)(=O)O[C@H]2[C@H]1O
InChI Key InChIKey=ZOOGRGPOEVQQDX-UUOKFMHZSA-N
Data  1 IC50
PDB links: 53 PDB IDs match this monomer.
  Tab Delimited (TSV)   2D SDfile   Computed 3D by Vconf -m prep SDfile
Find this compound or compounds like it in BindingDB:
Activity Spreadsheet -- Enzyme Inhibition Constant Data from BindingDB
Found 1 hit for monomerid = 50369127
TargetPhosphodiesterase(Bos taurus)
Kyowa Hakka
Curated by ChEMBL
LigandPNGBDBM50369127(CHEMBL395336)
Affinity DataIC50:  100nM. Assay description: Inhibition of bovine arterial Phosphodiesterase 3
In DepthDetails ArticlePubMed