BDBM50370132 CHEMBL1788235
SMILES CC[C@@H]1CN2C(=N1)c1c(nc(-c3ccccc3)n1C)N(C)C2=O
InChI Key InChIKey=CJKUBRUCGUVLII-GFCCVEGCSA-N
Data  2 KI
  Tab Delimited (TSV)   2D SDfile   Computed 3D by Vconf -m prep SDfile
Find this compound or compounds like it in BindingDB:
Activity Spreadsheet -- Enzyme Inhibition Constant Data from BindingDB
Found 2 hits for monomerid = 50370132
TargetAdenosine receptor A1(Rattus norvegicus (rat))
University Of Bonn
Curated by ChEMBL
LigandPNGBDBM50370132(CHEMBL1788235)
Affinity DataKi:  1.75E+4nM. Assay description: Binding affinity against Adenosine A1 receptor by displacing [3H]CHA radioligand in rat brain cortical membrane
In DepthDetails ArticlePubMed
TargetAdenosine receptor A2a(Rattus norvegicus (rat))
University Of Bonn
Curated by ChEMBL
LigandPNGBDBM50370132(CHEMBL1788235)
Affinity DataKi:  3.63E+4nM. Assay description: Binding affinity to the adenosine A2A receptor by displacement of [3H]CGS-21680 in rat brain striatal membrane
In DepthDetails ArticlePubMed