BDBM50370531 CHEMBL608755
SMILES CCNC(=O)[C@H]1OC([C@H](O)[C@@H]1O)n1cnc2c(NC(=O)Nc3ccc(cc3)S(=O)(=O)N(C)C(C)C)ncnc12
InChI Key InChIKey=SIKVQYFPRNFSGT-OFRRTHGGSA-N
Data  3 KI  1 IC50
  Tab Delimited (TSV)   2D SDfile   Computed 3D by Vconf -m prep SDfile
Find this compound or compounds like it in BindingDB:
Activity Spreadsheet -- Enzyme Inhibition Constant Data from BindingDB
Found 4 hits for monomerid = 50370531
TargetAdenosine receptor A3(Homo sapiens (Human))
Universit£
Curated by ChEMBL
LigandPNGBDBM50370531(CHEMBL608755)
Affinity DataKi:  8nM. Assay description: Displacement of [125I]AB-MECA binding to Adenosine A3 receptor expressed in CHO cells
In DepthDetails ArticlePubMed
TargetAdenosine receptor A1(Homo sapiens (Human))
Universit£
Curated by ChEMBL
LigandPNGBDBM50370531(CHEMBL608755)
Affinity DataKi:  325nM. Assay description: Displacement of [3H]CHA binding to Adenosine A1 receptor expressed in CHO cells
In DepthDetails ArticlePubMed
TargetAdenosine receptor A2a(Homo sapiens (Human))
Universit£
Curated by ChEMBL
LigandPNGBDBM50370531(CHEMBL608755)
Affinity DataKi: >1.00E+3nM. Assay description: Displacement of [3H]CGS-21680 binding to Adenosine A2 receptor expressed in CHO cells
In DepthDetails ArticlePubMed
TargetAdenosine receptor A3(Homo sapiens (Human))
Universit£
Curated by ChEMBL
LigandPNGBDBM50370531(CHEMBL608755)
Affinity DataIC50:  55nM. Assay description: Inhibition of (10 uM) forskolin-mediated cAMP production in CHO cells expressing human Adenosine A3 receptor
In DepthDetails ArticlePubMed