BDBM50370791 CHEMBL221189
SMILES OC(=O)c1cnn(c1)-c1ccc(COCc2ccccc2)cn1
InChI Key InChIKey=QMWGOLXBUKEODQ-UHFFFAOYSA-N
Data  1 IC50
  Tab Delimited (TSV)   2D SDfile   Computed 3D by Vconf -m prep SDfile
Find this compound or compounds like it in BindingDB:
Activity Spreadsheet -- Enzyme Inhibition Constant Data from BindingDB
Found 1 hit for monomerid = 50370791
TargetEgl nine homolog 1(Homo sapiens (Human))
Procter And Gamble Pharmaceuticals
Curated by ChEMBL
LigandPNGBDBM50370791(CHEMBL221189)
Affinity DataIC50:  2.70E+3nM. Assay description: Inhibition of human EGLN1
In DepthDetails ArticlePubMed