BDBM50370792 CHEMBL222114
SMILES COc1ccc(COCc2ccc(nc2)-n2cc(cn2)C(O)=O)cc1
InChI Key InChIKey=PUDPFAQGRSUVMS-UHFFFAOYSA-N
Data  1 IC50
  Tab Delimited (TSV)   2D SDfile   Computed 3D by Vconf -m prep SDfile
Find this compound or compounds like it in BindingDB:
Activity Spreadsheet -- Enzyme Inhibition Constant Data from BindingDB
Found 1 hit for monomerid = 50370792
TargetEgl nine homolog 1(Homo sapiens (Human))
Procter And Gamble Pharmaceuticals
Curated by ChEMBL
LigandPNGBDBM50370792(CHEMBL222114)
Affinity DataIC50:  2.40E+3nM. Assay description: Inhibition of human EGLN1
In DepthDetails ArticlePubMed