BDBM50370896 CHEMBL389268
SMILES CCCCOc1ccc(cc1)C(=O)Nc1ccc2nc(SCc3c(C)cc(C)c(C(C)=O)c3C)sc2c1
InChI Key InChIKey=XJQMMHCQUJOAQW-UHFFFAOYSA-N
Data  1 EC50
  Tab Delimited (TSV)   2D SDfile   Computed 3D by Vconf -m prep SDfile
Find this compound or compounds like it in BindingDB:
Activity Spreadsheet -- Enzyme Inhibition Constant Data from BindingDB
Found 1 hit for monomerid = 50370896
TargetATP-dependent translocase ABCB1(Homo sapiens (Human))
University Of Vienna
Curated by ChEMBL
LigandPNGBDBM50370896(CHEMBL389268)
Affinity DataEC50:  97nM. Assay description: Inhibition of P-glycoprotein expressed in MDR CCRF vcr1000 cells by daunorubicin efflux assay
In DepthDetails ArticlePubMed