BDBM50373103 CHEMBL258913
SMILES Brc1ccc(cc1)C(=O)N[C@H]1CCOC1=O
InChI Key InChIKey=FKBDDIATWGVLAF-VIFPVBQESA-N
Data  1 IC50
  Tab Delimited (TSV)   2D SDfile   Computed 3D by Vconf -m prep SDfile
Find this compound or compounds like it in BindingDB:
Activity Spreadsheet -- Enzyme Inhibition Constant Data from BindingDB
Found 1 hit for monomerid = 50373103
TargetQuorum-sensing transcriptional repressor QscR(Pseudomonas aeruginosa)
University Of Wisconsin-Madison
Curated by ChEMBL
LigandPNGBDBM50373103(CHEMBL258913)
Affinity DataIC50:  180nM. Assay description: Antagonist activity at Pseudomonas aeruginosa QscR expressed in Escherichia coli assessed as inhibition of dodecanoyl homoserine lactone induced prod...
In DepthDetails ArticlePubMed