BDBM50375157 CHEMBL273193
SMILES NC(=O)c1cn(-c2ccc3CCCc3c2)c2nc(Nc3ccc(C[C@H]4COC(=O)N4)cc3)ncc2c1=O
InChI Key InChIKey=BEDUDWXZVLGZTN-IBGZPJMESA-N
Data  1 IC50
  Tab Delimited (TSV)   2D SDfile   Computed 3D by Vconf -m prep SDfile
Find this compound or compounds like it in BindingDB:
Activity Spreadsheet -- Enzyme Inhibition Constant Data from BindingDB
Found 1 hit for monomerid = 50375157
TargetMacrophage colony-stimulating factor 1 receptor(Homo sapiens (Human))
Johnson & Johnson Pharmaceutical Research & Development
Curated by ChEMBL
LigandPNGBDBM50375157(CHEMBL273193)
Affinity DataIC50:  12nM. Assay description: Inhibition of ATP-induced CSF1R autophosphorylation
In DepthDetails ArticlePubMed