BDBM50375589 CHEMBL411070
SMILES C[C@H](CCC(=O)NCC(O)=O)[C@H]1CC[C@H]2[C@@H]3[C@H](O)C[C@@H]4C[C@H](O)CC[C@]4(C)[C@H]3C[C@H](O)[C@]12C
InChI Key InChIKey=RFDAIACWWDREDC-FRVQLJSFSA-N
Data  1 KI  1 EC50
PDB links: 6 PDB IDs match this monomer.
  Tab Delimited (TSV)   2D SDfile   Computed 3D by Vconf -m prep SDfile
Find this compound or compounds like it in BindingDB:
Activity Spreadsheet -- Enzyme Inhibition Constant Data from BindingDB
Found 2 hits for monomerid = 50375589
TargetBile salt export pump(Homo sapiens (Human))
King'S College Hospital
Curated by ChEMBL
LigandPNGBDBM50375589(CHEMBL411070)
Affinity DataKi:  1.10E+4nM. Assay description: TP_TRANSPORTER: competitive inhibition of Taurocholate uptake in membrane vesicles prepared from High Five cells infected with the ABCB11 baculovirus
In DepthDetails ArticlePubMed
TargetG-protein coupled bile acid receptor 1(Homo sapiens (Human))
Centre National de la Recherche Scientifique/INSERM/ULP
Curated by ChEMBL
LigandPNGBDBM50375589(CHEMBL411070)
Affinity DataEC50:  1.36E+4nM. Assay description: Agonist activity at human TGR5 expressed in CHO cells by luciferase assay
In DepthDetails ArticlePubMed