BDBM50376412 CHEMBL254347
SMILES OCc1oc(nc1CCOc1ccc(CN(CC(O)=O)C(=O)Oc2ccc(O)cc2)cc1)-c1ccccc1
InChI Key InChIKey=YIRXLRFQQYZVHN-UHFFFAOYSA-N
Data  3 IC50  1 EC50
  Tab Delimited (TSV)   2D SDfile   Computed 3D by Vconf -m prep SDfile
Find this compound or compounds like it in BindingDB:
Activity Spreadsheet -- Enzyme Inhibition Constant Data from BindingDB
Found 4 hits for monomerid = 50376412
TargetPeroxisome proliferator-activated receptor alpha(Homo sapiens (Human))
Bristol-Myers Squibb
Curated by ChEMBL
LigandPNGBDBM50376412(CHEMBL254347)
Affinity DataIC50: >1.50E+4nM. Assay description: Binding affinity at PPAR alpha receptor
In DepthDetails ArticlePubMed
TargetPeroxisome proliferator-activated receptor alpha(Homo sapiens (Human))
Bristol-Myers Squibb
Curated by ChEMBL
LigandPNGBDBM50376412(CHEMBL254347)
Affinity DataEC50:  1.81E+4nM. Assay description: Agonist activity at PPAR alpha in human HEK cells by transactivation assay
In DepthDetails ArticlePubMed
TargetPeroxisome proliferator-activated receptor gamma(Homo sapiens (Human))
Bristol-Myers Squibb
Curated by ChEMBL
LigandPNGBDBM50376412(CHEMBL254347)
Affinity DataIC50: >2.50E+4nM. Assay description: Agonist activity at PPAR gamma in human HEK cells by transactivation assay
In DepthDetails ArticlePubMed
TargetPeroxisome proliferator-activated receptor gamma(Homo sapiens (Human))
Bristol-Myers Squibb
Curated by ChEMBL
LigandPNGBDBM50376412(CHEMBL254347)
Affinity DataIC50: >1.50E+4nM. Assay description: Binding affinity at PPAR gamma receptor
In DepthDetails ArticlePubMed