BDBM50377075 CHEMBL265433
SMILES CN1CCN(CC1)c1ccc(NC(=O)c2ccc(o2)C#N)c(c1)-c1ccsc1C
InChI Key InChIKey=ZWRCMAAVANOLOT-UHFFFAOYSA-N
Data  1 IC50
  Tab Delimited (TSV)   2D SDfile   Computed 3D by Vconf -m prep SDfile
Find this compound or compounds like it in BindingDB:
Activity Spreadsheet -- Enzyme Inhibition Constant Data from BindingDB
Found 1 hit for monomerid = 50377075
TargetMacrophage colony-stimulating factor 1 receptor(Homo sapiens (Human))
Johnson & Johnson Pharmaceutical Research & Development
Curated by ChEMBL
LigandPNGBDBM50377075(CHEMBL265433)
Affinity DataIC50:  940nM. Assay description: Inhibition of FMS
In DepthDetails ArticlePubMed