BDBM50377390 CHEMBL256984
SMILES COc1c2CCC(c3ncc[nH]3)c2ccc1C
InChI Key InChIKey=DHMOWBLMIPAURS-UHFFFAOYSA-N
Data  4 EC50
  Tab Delimited (TSV)   2D SDfile   Computed 3D by Vconf -m prep SDfile
Find this compound or compounds like it in BindingDB:
Activity Spreadsheet -- Enzyme Inhibition Constant Data from BindingDB
Found 4 hits for monomerid = 50377390
TargetAlpha-2A adrenergic receptor(Homo sapiens (Human))
Pfizer
Curated by ChEMBL
LigandPNGBDBM50377390(CHEMBL256984)
Affinity DataEC50:  327nM. Assay description: Agonist activity at human cloned adrenergic alpha-2A receptor expressed in CHOK1 cells by beta-lactamase reporter gene assay
In DepthDetails ArticlePubMed
TargetAlpha-1D adrenergic receptor(Homo sapiens (Human))
Pfizer
Curated by ChEMBL
LigandPNGBDBM50377390(CHEMBL256984)
Affinity DataEC50: >1.00E+4nM. Assay description: Agonist activity at human cloned adrenergic Alpha-1D receptor expressed in CHO cells assessed as calcium mobilization by FLIPR
In DepthDetails ArticlePubMed
TargetAlpha-1B adrenergic receptor(Homo sapiens (Human))
Pfizer
Curated by ChEMBL
LigandPNGBDBM50377390(CHEMBL256984)
Affinity DataEC50: >1.00E+4nM. Assay description: Agonist activity at human cloned adrenergic alpha-1B receptor expressed in CHO cells assessed as calcium mobilization by FLIPR
In DepthDetails ArticlePubMed
TargetAlpha-1A adrenergic receptor(Homo sapiens (Human))
Pfizer
Curated by ChEMBL
LigandPNGBDBM50377390(CHEMBL256984)
Affinity DataEC50:  167nM. Assay description: Agonist activity at human cloned adrenergic alpha-1A receptor expressed in CHO cells assessed as calcium mobilization by FLIPR
In DepthDetails ArticlePubMed