BDBM50377630 CHEMBL404448
SMILES Cc1ccc(NC(=O)c2ccc(cc2)N2CCCCC2=O)c(c1)C(=O)Nc1ccc(Cl)cn1
InChI Key InChIKey=OUBANJCHOQDKJG-UHFFFAOYSA-N
Data  1 KI
  Tab Delimited (TSV)   2D SDfile   Computed 3D by Vconf -m prep SDfile
Find this compound or compounds like it in BindingDB:
Activity Spreadsheet -- Enzyme Inhibition Constant Data from BindingDB
Found 1 hit for monomerid = 50377630
TargetCoagulation factor X(Homo sapiens (Human))
Bristol-Myers Squibb Research And Development
Curated by ChEMBL
LigandPNGBDBM50377630(CHEMBL404448)
Affinity DataKi:  0.190nM. Assay description: Inhibition of human factor 10a
In DepthDetails ArticlePubMed