BDBM50377643 CHEMBL257966
SMILES Clc1ccc(NC(=O)c2ccccc2NC(=O)c2ccc(cc2)-n2ccccc2=O)cc1
InChI Key InChIKey=SKRZXXNVXDYSIK-UHFFFAOYSA-N
Data  1 KI
  Tab Delimited (TSV)   2D SDfile   Computed 3D by Vconf -m prep SDfile
Find this compound or compounds like it in BindingDB:
Activity Spreadsheet -- Enzyme Inhibition Constant Data from BindingDB
Found 1 hit for monomerid = 50377643
TargetCoagulation factor X(Homo sapiens (Human))
Bristol-Myers Squibb Research And Development
Curated by ChEMBL
LigandPNGBDBM50377643(CHEMBL257966)
Affinity DataKi:  0.210nM. Assay description: Inhibition of human factor 10a
In DepthDetails ArticlePubMed