BDBM50377988 CHEMBL552521
SMILES COc1cccc(c1)C(=O)N[C@@H]1[C@H](O)[C@@H](COP(O)(=O)OP(O)(=O)O[C@H]2O[C@H]([C@H](O)[C@@H]2O)[n+]2ccc(cc2)C(N)=O)O[C@H]1n1cnc2c(NCc3cccc4ccccc34)ncnc12
InChI Key InChIKey=GMAOTGREPAAOFF-CWFIGKTDSA-O
Data  1 IC50
  Tab Delimited (TSV)   2D SDfile   Computed 3D by Vconf -m prep SDfile
Find this compound or compounds like it in BindingDB:
Activity Spreadsheet -- Enzyme Inhibition Constant Data from BindingDB
Found 1 hit for monomerid = 50377988
TargetGlyceraldehyde-3-phosphate dehydrogenase, glycosomal(Trypanosoma cruzi)
Universidade De S£O Paulo
Curated by ChEMBL
LigandPNGBDBM50377988(CHEMBL552521)
Affinity DataIC50:  100nM. Assay description: Inhibition of Trypanosoma cruzi recombinant glycosomal GAPDH expressed in Escherichia coli by spectrophotometry
In DepthDetails ArticlePubMed