BDBM50378551 CHEMBL568630
SMILES CC(C(O)=O)c1nn(C)c2nc(N)[nH]c(=O)c2c1=O
InChI Key InChIKey=XUKTUWRGSZSUGO-UHFFFAOYSA-N
Data  1 IC50
PDB links: 1 PDB ID matches this monomer.
  Tab Delimited (TSV)   2D SDfile   Computed 3D by Vconf -m prep SDfile
Find this compound or compounds like it in BindingDB:
Activity Spreadsheet -- Enzyme Inhibition Constant Data from BindingDB
Found 1 hit for monomerid = 50378551
TargetDihydropteroate synthase(Bacillus anthracis)
University Of Tennessee Health Science Center
Curated by ChEMBL
LigandPNGBDBM50378551(CHEMBL568630)
Affinity DataIC50:  1.98E+4nM. Assay description: Inhibition of Bacillus anthracis DHPS expressed in Escherichia coli BL21 (DE3) after 30 mins