BDBM50380263 CHEMBL2017230
SMILES Cc1ccccc1Nc1nc(nc2c(NC3CCCCC3)ncnc12)N1CCNCC1
InChI Key InChIKey=DOQKCZFSWGCKGM-UHFFFAOYSA-N
Data  1 IC50
  Tab Delimited (TSV)   2D SDfile   Computed 3D by Vconf -m prep SDfile
Find this compound or compounds like it in BindingDB:
Activity Spreadsheet -- Enzyme Inhibition Constant Data from BindingDB
Found 1 hit for monomerid = 50380263
TargetKetohexokinase(Homo sapiens (Human))
TBA
Curated by ChEMBL
LigandPNGBDBM50380263(CHEMBL2017230)
Affinity DataIC50:  2.30E+3nM. Assay description: Inhibition of human ketohexokinase isoform C expressed in Escherichia coli BL21 (DE3) cells using D-fructose as substrate after 12 to 15 mins by fluo...
In DepthDetails ArticlePubMed