BDBM50383091 CHEMBL2031573
SMILES Fc1ccc(cc1)-c1ccc(cc1)C(=O)Nc1ccc2cc(CN3CCCC3)ccc2c1
InChI Key InChIKey=UUVLZGBRJNIVPH-UHFFFAOYSA-N
Data  3 IC50
  Tab Delimited (TSV)   2D SDfile   Computed 3D by Vconf -m prep SDfile
Find this compound or compounds like it in BindingDB:
Activity Spreadsheet -- Enzyme Inhibition Constant Data from BindingDB
Found 3 hits for monomerid = 50383091
TargetMelanin-concentrating hormone receptor 1(Homo sapiens (Human))
Takeda Pharmaceutical
Curated by ChEMBL
LigandPNGBDBM50383091(CHEMBL2031573)
Affinity DataIC50:  9nM. Assay description: Antagonist activity at human MCHR1 expressed in CHO cells assessed as inhibition of MCH-induced [3H]arachidonic acid release after 16 hrs by liquid s...
In DepthDetails ArticlePubMed
TargetMelanin-concentrating hormone receptor 1(Homo sapiens (Human))
Takeda Pharmaceutical
Curated by ChEMBL
LigandPNGBDBM50383091(CHEMBL2031573)
Affinity DataIC50:  0.760nM. Assay description: Displacement of [125I]MCH from human MCHR1 expressed in CHO cells after 1 hr by scintillation counting
In DepthDetails ArticlePubMed
Target5-hydroxytryptamine receptor 2C(Homo sapiens (Human))
Takeda Pharmaceutical
Curated by ChEMBL
LigandPNGBDBM50383091(CHEMBL2031573)
Affinity DataIC50:  120nM. Assay description: Displacement of [3H]mesulergine from human 5HT2C receptor expressed in CHO cells after 1 hr by scintillation counting
In DepthDetails ArticlePubMed