BDBM50386284 CHEMBL2041076
SMILES CCCC#Cc1cn([C@@H]2O[C@H](CO)[C@@H](O)[C@H](O)[C@H]2O)c(=O)[nH]c1=O
InChI Key InChIKey=XHEMRIMZCOFGEX-YGEZULPYSA-N
Data  1 KI
PDB links: 1 PDB ID matches this monomer.
  Tab Delimited (TSV)   2D SDfile   Computed 3D by Vconf -m prep SDfile
Find this compound or compounds like it in BindingDB:
Activity Spreadsheet -- Enzyme Inhibition Constant Data from BindingDB
Found 1 hit for monomerid = 50386284
TargetGlycogen phosphorylase, muscle form(Oryctolagus cuniculus (rabbit))
University Of Thessaly
Curated by ChEMBL
LigandPNGBDBM50386284(CHEMBL2041076)
Affinity DataKi:  3.03E+5nM. Assay description: Competitive inhibition of rabbit skeletal muscle glycogen phosphorylase b using Glc-1-P as substrate