BDBM50387892 CHEMBL2058390
SMILES CC(C)(C)OC(=O)N1CCC(CCCCCNc2ccc3c(CCS3(=O)=O)c2)CC1
InChI Key InChIKey=BPNGXXPWVUKDRR-UHFFFAOYSA-N
Data  1 EC50
  Tab Delimited (TSV)   2D SDfile   Computed 3D by Vconf -m prep SDfile
Find this compound or compounds like it in BindingDB:
Activity Spreadsheet -- Enzyme Inhibition Constant Data from BindingDB
Found 1 hit for monomerid = 50387892
TargetGlucose-dependent insulinotropic receptor(Homo sapiens (Human))
Sanwa Kagaku Kenkyusho
Curated by ChEMBL
LigandPNGBDBM50387892(CHEMBL2058390)
Affinity DataEC50:  145nM. Assay description: Agonist activity at human GPR119 receptor expressed in CHO-K1 cells assessed as cAMP accumulation after 30 mins by HTRF assay
In DepthDetails ArticlePubMed