BDBM50387902 CHEMBL2058403
SMILES CC(C)(C)OC(=O)N1CCC(CCCNc2ccc3CCC(=O)c3c2)CC1
InChI Key InChIKey=OTILYYCTGBTYKO-UHFFFAOYSA-N
Data  2 EC50
  Tab Delimited (TSV)   2D SDfile   Computed 3D by Vconf -m prep SDfile
Find this compound or compounds like it in BindingDB:
Activity Spreadsheet -- Enzyme Inhibition Constant Data from BindingDB
Found 2 hits for monomerid = 50387902
TargetGlucose-dependent insulinotropic receptor(Mus musculus)
Sanwa Kagaku Kenkyusho
Curated by ChEMBL
LigandPNGBDBM50387902(CHEMBL2058403)
Affinity DataEC50:  123nM. Assay description: Agonist activity at mouse GPR119 receptor expressed in CHO-K1 cells assessed as cAMP accumulation after 30 mins by HTRF assay
In DepthDetails ArticlePubMed
TargetGlucose-dependent insulinotropic receptor(Homo sapiens (Human))
Sanwa Kagaku Kenkyusho
Curated by ChEMBL
LigandPNGBDBM50387902(CHEMBL2058403)
Affinity DataEC50:  46nM. Assay description: Agonist activity at human GPR119 receptor expressed in CHO-K1 cells assessed as cAMP accumulation after 30 mins by HTRF assay
In DepthDetails ArticlePubMed