BDBM50389304 CHEMBL2063797
SMILES [O-][N+](=O)c1ccc2Nc3ccc(OCCF)cc3Sc2c1
InChI Key InChIKey=YLFOKDQDWWSPHW-UHFFFAOYSA-N
Data  1 KI  1 IC50
  Tab Delimited (TSV)   2D SDfile   Computed 3D by Vconf -m prep SDfile
Find this compound or compounds like it in BindingDB:
Activity Spreadsheet -- Enzyme Inhibition Constant Data from BindingDB
Found 2 hits for monomerid = 50389304
TargetAlpha-synuclein(Homo sapiens (Human))
Washington University
Curated by ChEMBL
LigandPNGBDBM50389304(CHEMBL2063797)
Affinity DataKi:  49nM. Assay description: Binding affinity to human alpha-synuclein expressed in Escherichia coli BL21 (DE3) cells after 1 hr by thioflavin T fluorescence assay
In DepthDetails ArticlePubMed
TargetAlpha-synuclein(Homo sapiens (Human))
Washington University
Curated by ChEMBL
LigandPNGBDBM50389304(CHEMBL2063797)
Affinity DataIC50:  204nM. Assay description: Binding affinity to human alpha-synuclein expressed in Escherichia coli BL21 (DE3) cells after 1 hr by thioflavin T fluorescence assay
In DepthDetails ArticlePubMed