BDBM50389618 CHEMBL2069765::CHEMBL2069787
SMILES Cc1ccc(cc1)N1Oc2c(O)n(c(O)c2[C@@H]1c1ccccc1)-c1ccc(cc1)C(O)=O
InChI Key InChIKey=AGJROPLTIDZNSV-NRFANRHFSA-N
Data  2 IC50
  Tab Delimited (TSV)   2D SDfile   Computed 3D by Vconf -m prep SDfile
Find this compound or compounds like it in BindingDB:
Activity Spreadsheet -- Enzyme Inhibition Constant Data from BindingDB
Found 2 hits for monomerid = 50389618
TargetAcetylcholinesterase(Rattus norvegicus (rat))
Punjabi University
Curated by ChEMBL
LigandPNGBDBM50389618(CHEMBL2069765 | CHEMBL2069787)
Affinity DataIC50:  22.8nM. Assay description: Inhibition of AChE activity in rat brain homogenate using acetylthiocholine as substrate by Ellman's method
In DepthDetails ArticlePubMed
TargetAcetylcholinesterase(Rattus norvegicus (rat))
Punjabi University
Curated by ChEMBL
LigandPNGBDBM50389618(CHEMBL2069765 | CHEMBL2069787)
Affinity DataIC50:  22.4nM. Assay description: Inhibition of AChE activity in rat brain homogenate using acetylthiocholine as substrate by Ellman's method
In DepthDetails ArticlePubMed