BDBM50390289 CHEMBL2070750
SMILES Cc1ccc(CNc2nc(nc3n(C[C@H]4CCCO4)nnc23)C(F)(F)F)cc1
InChI Key InChIKey=NZFKRHRJHVENPR-CYBMUJFWSA-N
Data  1 IC50
  Tab Delimited (TSV)   2D SDfile   Computed 3D by Vconf -m prep SDfile
Find this compound or compounds like it in BindingDB:
Activity Spreadsheet -- Enzyme Inhibition Constant Data from BindingDB
Found 1 hit for monomerid = 50390289
LigandPNGBDBM50390289(CHEMBL2070750)
Affinity DataIC50: >1.00E+4nM. Assay description: Inhibition of PDE8B expressed in Sf9 insect cells
In DepthDetails ArticlePubMed