BDBM50390316 CHEMBL2070598
SMILES Nc1nc(nc2n(CC3CCCCO3)nnc12)-c1ccccc1
InChI Key InChIKey=GXSLVJDWQMGUAQ-UHFFFAOYSA-N
Data  1 IC50
  Tab Delimited (TSV)   2D SDfile   Computed 3D by Vconf -m prep SDfile
Find this compound or compounds like it in BindingDB:
Activity Spreadsheet -- Enzyme Inhibition Constant Data from BindingDB
Found 1 hit for monomerid = 50390316
LigandPNGBDBM50390316(CHEMBL2070598)
Affinity DataIC50:  160nM. Assay description: Inhibition of PDE8B expressed in Sf9 insect cells
In DepthDetails ArticlePubMed