BDBM50390318 CHEMBL2070607
SMILES Nc1nc(nc2n(C[C@H]3CCCO3)cnc12)C1CC1
InChI Key InChIKey=FTEXGDMCLVGFQG-SECBINFHSA-N
Data  1 IC50
  Tab Delimited (TSV)   2D SDfile   Computed 3D by Vconf -m prep SDfile
Find this compound or compounds like it in BindingDB:
Activity Spreadsheet -- Enzyme Inhibition Constant Data from BindingDB
Found 1 hit for monomerid = 50390318
LigandPNGBDBM50390318(CHEMBL2070607)
Affinity DataIC50: >2.00E+3nM. Assay description: Inhibition of PDE8B expressed in Sf9 insect cells
In DepthDetails ArticlePubMed