BDBM50390319 CHEMBL2070608
SMILES Nc1nc(nc2n(CC3CCCO3)ncc12)C1CC1
InChI Key InChIKey=QRKOTSSVGSVCDJ-UHFFFAOYSA-N
Data  1 IC50
  Tab Delimited (TSV)   2D SDfile   Computed 3D by Vconf -m prep SDfile
Find this compound or compounds like it in BindingDB:
Activity Spreadsheet -- Enzyme Inhibition Constant Data from BindingDB
Found 1 hit for monomerid = 50390319
LigandPNGBDBM50390319(CHEMBL2070608)
Affinity DataIC50: >1.00E+4nM. Assay description: Inhibition of PDE8B expressed in Sf9 insect cells
In DepthDetails ArticlePubMed